Target
Platelet-activating factor receptor
Ligand
BDBM50011104
Substrate
Meas. Tech.
ChEBML_177423
IC50
1700±n/a nM
Citation
 Bartrolí, JCarceller, EMerlos, MGarcía-Rafanell, JForn, J Disubstituted tetrahydrofurans and dioxolanes and PAF antagonists. J Med Chem 34:373-86 (1991)  
Target
Name:
Platelet-activating factor receptor
Synonyms:
PAF-R PTAFR_CAVPO Platelet-activating factor receptor
Type:
Protein
Mol. Mass.:
39005.63
Organism:
Cavia porcellus
Description:
Residue:
342
  
Inhibitor
Name:
BDBM50011104
Synonyms:
CHEMBL124523 | Toluene-4-sulfonate3-[7-(4-hexadecyl-tetrahydro-furan-2-ylmethoxy)-heptyl]-thiazol-3-ium;Toluene-4-sulfonate
Type:
Small organic molecule
Emp. Form.:
C31H58NO2S
Mol. Mass.:
508.862
SMILES:
CCCCCCCCCCCCCCCCC1COC(COCCCCCCC[n+]2ccsc2)C1
: