Target
Gastrin/cholecystokinin type B receptor
Ligand
BDBM50011198
Substrate
Meas. Tech.
ChEBML_47828
IC50
1.9±n/a nM
Citation
 Holladay, MWLin, CWMay, CSGarvey, DSWitte, DGMiller, TRWolfram, CANadzan, AM trans-3-n-propyl-L-proline is a highly favorable, conformationally restricted replacement for methionine in the C-terminal tetrapeptide of cholecystokinin. Stereoselective synthesis of 3-allyl- and 3-n-propyl-L-proline derivatives from 4-hydroxy-L-proline. J Med Chem 34:455-7 (1991)  
Target
Name:
Gastrin/cholecystokinin type B receptor
Synonyms:
CCK-2 receptor CCK-BR CCKRB Cholecystokinin receptor GASR_HUMAN | Gastrin/cholecystokinin type B receptor
Type:
G Protein-Coupled Receptor (GPCR)
Mol. Mass.:
48445.79
Organism:
Homo sapiens (Human)
Description:
Stable expression of human CCK-2 receptors in HEK 293 cells.
Residue:
447
  
Inhibitor
Name:
BDBM50011198
Synonyms:
3-({1-[2-tert-Butoxycarbonylamino-3-(1H-indol-3-yl)-propionyl]-3-propyl-pyrrolidine-2-carbonyl}-amino)-N-(1-carbamoyl-2-phenyl-ethyl)-succinamic acid | CHEMBL3143186
Type:
Small organic molecule
Emp. Form.:
C37H48N6O8
Mol. Mass.:
704.8124
SMILES:
CCC[C@@H]1CCN([C@@H]1C(=O)N[C@@H](CC(O)=O)C(=O)N[C@@H](Cc1ccccc1)C(N)=O)C(=O)[C@H](Cc1c[nH]c2ccccc12)NC(=O)OC(C)(C)C
: