Target
Atypical chemokine receptor 3
Ligand
BDBM50264280
Substrate
Meas. Tech.
ChEMBL_1698434 (CHEMBL4049324)
Ki
18±n/a nM
Citation
 Menhaji-Klotz, EHesp, KDLondregan, ATKalgutkar, ASPiotrowski, DWBoehm, MSong, KRyder, TBeaumont, KJones, RMAtkinson, KBrown, JALitchfield, JXiao, JCanterbury, DPBurford, KThuma, BALimberakis, CJiao, WBagley, SWAgarwal, SCrowell, DPazdziorko, SWard, JPrice, DAClerin, V Discovery of a Novel Small-Molecule Modulator of C-X-C Chemokine Receptor Type 7 as a Treatment for Cardiac Fibrosis. J Med Chem 61:3685-3696 (2018)  
Target
Name:
Atypical chemokine receptor 3
Synonyms:
ACKR3_MOUSE Atypical chemokine receptor 3 CXC-R7 Chemokine orphan receptor 1 Cxcr7 RDC-1 | Rdc1
Type:
PROTEIN
Mol. Mass.:
41640.48
Organism:
Mus musculus
Description:
ChEMBL_117401
Residue:
362
  
Inhibitor
Name:
BDBM50264280
Synonyms:
CHEMBL4084050
Type:
Small organic molecule
Emp. Form.:
C29H42N6O3
Mol. Mass.:
522.6822
SMILES:
[H][C@@]12CC[C@@]([H])(O1)[C@H](C2)C(=O)N1CCC(CC1)[C@H](CC(N)=O)N1CCCN(CC1)c1c(CC)ccn2ccnc12
: