Target
Adenosine receptor A1
Ligand
BDBM50004594
Substrate
Meas. Tech.
ChEMBL_29295 (CHEMBL640356)
Ki
81±n/a nM
Citation
 Shimada, JSuzuki, FNonaka, HKarasawa, AMizumoto, HOhno, TKubo, KIshii, A 8-(Dicyclopropylmethyl)-1,3-dipropylxanthine: a potent and selective adenosine A1 antagonist with renal protective and diuretic activities. J Med Chem 34:466-9 (1991)  
Target
Name:
Adenosine receptor A1
Synonyms:
A1 adenosine receptor ADENOSINE A1 ADENOSINE A1 low Adenosine A1 receptor | Adenosine Receptor A1
Type:
Enzyme Catalytic Domain
Mol. Mass.:
36501.39
Organism:
GUINEA PIG
Description:
ADENOSINE A1 ADORA1 GUINEA PIG::P47745
Residue:
326
  
Inhibitor
Name:
BDBM50004594
Synonyms:
8-Dicyclopropylmethyl-1,3-dimethyl-3,7-dihydro-purine-2,6-dione | CHEMBL106937
Type:
Small organic molecule
Emp. Form.:
C14H18N4O2
Mol. Mass.:
274.3183
SMILES:
Cn1c2nc([nH]c2c(=O)n(C)c1=O)C(C1CC1)C1CC1
: