Target
Adenosine receptor A1
Ligand
BDBM50011218
Substrate
Meas. Tech.
ChEMBL_29295 (CHEMBL640356)
Ki
900±n/a nM
Citation
 Shimada, JSuzuki, FNonaka, HKarasawa, AMizumoto, HOhno, TKubo, KIshii, A 8-(Dicyclopropylmethyl)-1,3-dipropylxanthine: a potent and selective adenosine A1 antagonist with renal protective and diuretic activities. J Med Chem 34:466-9 (1991)  
Target
Name:
Adenosine receptor A1
Synonyms:
A1 adenosine receptor ADENOSINE A1 ADENOSINE A1 low Adenosine A1 receptor | Adenosine Receptor A1
Type:
Enzyme Catalytic Domain
Mol. Mass.:
36501.39
Organism:
GUINEA PIG
Description:
ADENOSINE A1 ADORA1 GUINEA PIG::P47745
Residue:
326
  
Inhibitor
Name:
BDBM50011218
Synonyms:
8-(1-Phenoxy-propyl)-1,3-dipropyl-3,7-dihydro-purine-2,6-dione | CHEMBL346382
Type:
Small organic molecule
Emp. Form.:
C20H26N4O3
Mol. Mass.:
370.4454
SMILES:
CCCn1c2nc([nH]c2c(=O)n(CCC)c1=O)C(CC)Oc1ccccc1
: