Target
Renin
Ligand
BDBM50011227
Substrate
Meas. Tech.
ChEMBL_195747 (CHEMBL801599)
pH
7.4±n/a
IC50
43±n/a nM
Comments
extracted
Citation
 Rosenberg, SHKleinert, HDStein, HHMartin, DLChekal, MACohen, JEgan, DATricarico, KABaker, WR Design of a well-absorbed renin inhibitor. J Med Chem 34:469-71 (1991)  
Target
Name:
Renin
Synonyms:
Angiotensinogenase RENI_HUMAN
Type:
Enzyme
Mol. Mass.:
45058.99
Organism:
Homo sapiens (Human)
Description:
Residue:
406
  
Inhibitor
Name:
BDBM50011227
Synonyms:
2-Benzyl-N-{1-[1-cyclohexylmethyl-2-(3-ethyl-2-oxo-oxazolidin-5-yl)-2-hydroxy-ethylcarbamoyl]-2-thiophen-2-yl-ethyl}-4-morpholin-4-yl-4-oxo-butyramide | CHEMBL341975
Type:
Small organic molecule
Emp. Form.:
C36H50N4O7S
Mol. Mass.:
682.87
SMILES:
CCN1C[C@H](OC1=O)[C@H](O)[C@H](CC1CCCCC1)NC(=O)[C@H](Cc1cccs1)NC(=O)[C@@H](CC(=O)N1CCOCC1)Cc1ccccc1
: