Target
Renin
Ligand
BDBM50011341
Substrate
Meas. Tech.
ChEBML_195778
IC50
0.280000±n/a nM
Citation
 Thaisrivongs, SPals, DTDuCharme, DWTurner, SRDeGraaf, GLLawson, JACouch, SJWilliams, MV Renin inhibitory peptides. Incorporation of polar, hydrophilic end groups into an active renin inhibitory peptide template and their evaluation in a human renin infused rat model and in conscious sodium-depleted monkeys. J Med Chem 34:633-42 (1991)  
Target
Name:
Renin
Synonyms:
Angiotensinogenase RENI_HUMAN
Type:
Enzyme
Mol. Mass.:
45058.99
Organism:
Homo sapiens (Human)
Description:
Residue:
406
  
Inhibitor
Name:
BDBM50011341
Synonyms:
2-Amino-5-[2-(1-{[1-[1-cyclohexylmethyl-2-hydroxy-5-methyl-4-(3-methyl-butylcarbamoyl)-hexylcarbamoyl]-2-(3H-imidazol-4-yl)-ethyl]-methyl-carbamoyl}-2-phenyl-ethylcarbamoyl)-pyrrolidin-1-yl]-5-oxo-pentanoic acid | CHEMBL3143478
Type:
Small organic molecule
Emp. Form.:
C46H72N8O8
Mol. Mass.:
865.1127
SMILES:
CC(C)CCNC(=O)[C@@H](C[C@H](O)[C@H](CC1CCCCC1)NC(=O)[C@H](Cc1c[nH]cn1)N(C)C(=O)[C@H](Cc1ccccc1)NC(=O)[C@@H]1CCCN1C(=O)CC[C@H](N)C(O)=O)C(C)C
: