Target
Glucocorticoid receptor
Ligand
BDBM50265801
Substrate
Meas. Tech.
ChEMBL_1700169 (CHEMBL4051151)
Ki
0.140000±n/a nM
Citation
 Hunt, HJBelanoff, JKWalters, IGourdet, BThomas, JBarton, NUnitt, JPhillips, TSwift, DEaton, E Identification of the Clinical Candidate (R)-(1-(4-Fluorophenyl)-6-((1-methyl-1H-pyrazol-4-yl)sulfonyl)-4,4a,5,6,7,8-hexahydro-1H-pyrazolo[3,4-g]isoquinolin-4a-yl)(4-(trifluoromethyl)pyridin-2-yl)methanone (CORT125134): A Selective Glucocorticoid Receptor (GR) Antagonist. J Med Chem 60:3405-3421 (2017)  
Target
Name:
Glucocorticoid receptor
Synonyms:
GCR_HUMAN GRL Glucocorticoid receptor (GRFP) Nuclear receptor subfamily 3 group C member 1
Type:
Enzyme
Mol. Mass.:
85656.87
Organism:
Homo sapiens (Human)
Description:
P04150
Residue:
777
  
Inhibitor
Name:
BDBM50265801
Synonyms:
CHEMBL3735851
Type:
Small organic molecule
Emp. Form.:
C29H22FN5O3S
Mol. Mass.:
539.58
SMILES:
Fc1ccc(cc1)-n1ncc2C[C@@]3(CN(CCC3=Cc12)S(=O)(=O)c1cccc(c1)C#N)C(=O)c1ccccn1
: