Target
Tyrosine-protein kinase Lck
Ligand
BDBM50011419
Substrate
Meas. Tech.
ChEBML_210731
IC50
>2000000±n/a nM
Citation
 Cushman, MNagarathnam, DBurg, DLGeahlen, RL Synthesis and protein-tyrosine kinase inhibitory activities of flavonoid analogues. J Med Chem 34:798-806 (1991)  
Target
Name:
Tyrosine-protein kinase Lck
Synonyms:
2.7.10.2 LCK_HUMAN Leukocyte C-terminal Src kinase Lymphocyte-specific protein tyrosine kinase Protein YT16 Proto-oncogene tyrosine-protein kinase LCK T cell-specific protein-tyrosine kinase
Type:
Mol. Mass.:
57987.83
Organism:
Homo sapiens (Human)
Description:
P06239
Residue:
509
  
Inhibitor
Name:
BDBM50011419
Synonyms:
6-Methoxy-2-(4-nitro-phenyl)-4-oxo-4H-chromene-3-carboxylic acid methyl ester methyl 6-methoxy-2-(4-nitrophenyl)-4-oxo-4H-chromene-3-carboxylate
Type:
Small organic molecule
Emp. Form.:
C18H13NO7
Mol. Mass.:
355.2983
SMILES:
COC(=O)c1c(oc2ccc(OC)cc2c1=O)-c1ccc(cc1)[N+]([O-])=O
: