Target
Adenosine receptor A1
Ligand
BDBM50266662
Substrate
Meas. Tech.
ChEMBL_1701165 (CHEMBL4052147)
Ki
0.438000±n/a nM
Citation
 Petrelli, RScortichini, MKachler, SBoccella, SCerchia, CTorquati, IDel Bello, FSalvemini, DNovellino, ELuongo, LMaione, SJacobson, KALavecchia, AKlotz, KNCappellacci, L Exploring the Role of N J Med Chem 60:4327-4341 (2017)  
Target
Name:
Adenosine receptor A1
Synonyms:
A1 adenosine receptor (hA1) AA1R_HUMAN ADORA1 Adenosine A1-receptor Adenosine receptor A1 (hA1) | Adenosine transporter (AdT)
Type:
G Protein-Coupled Receptor (GPCR)
Mol. Mass.:
36520.92
Organism:
Homo sapiens (Human)
Description:
P30542
Residue:
326
  
Inhibitor
Name:
BDBM50266662
Synonyms:
CHEMBL4087306
Type:
Small organic molecule
Emp. Form.:
C16H21N9O3
Mol. Mass.:
387.3964
SMILES:
CCn1nnc(n1)[C@H]1O[C@H]([C@H](O)[C@@H]1O)n1cnc2c(NCC3CC3)ncnc12
: