Target
Platelet-activating factor receptor
Ligand
BDBM50011627
Substrate
Meas. Tech.
ChEBML_56498
IC50
4±n/a nM
Citation
 Walser, AFlynn, TMason, CCrowley, HMaresca, CYaremko, BO'Donnell, M Triazolobenzo- and triazolothienodiazepines as potent antagonists of platelet activating factor. J Med Chem 34:1209-21 (1991)  
Target
Name:
Platelet-activating factor receptor
Synonyms:
PAF Platelet activating factor PAFR PTAFR_HUMAN Platelet-activating factor receptor
Type:
Enzyme Catalytic Domain
Mol. Mass.:
39219.60
Organism:
Homo sapiens (Human)
Description:
PAF Platelet activating factor PTAFR HUMAN::P25105
Residue:
342
  
Inhibitor
Name:
BDBM50011627
Synonyms:
4-(2-Chloro-phenyl)-9-methyl-2-[3-(pyridin-3-yloxy)-prop-1-ynyl]-6H-1-thia-5,7,8,9a-tetraaza-cyclopenta[e]azulene | CHEMBL283339
Type:
Small organic molecule
Emp. Form.:
C23H16ClN5OS
Mol. Mass.:
445.924
SMILES:
Cc1nnc2CN=C(c3cc(sc3-n12)C#CCOc1cccnc1)c1ccccc1Cl
: