Target
Platelet-activating factor receptor
Ligand
BDBM50011854
Substrate
Meas. Tech.
ChEBML_154999
IC50
380±n/a nM
Citation
 Walser, AFlynn, TMason, CCrowley, HMaresca, CO'Donnell, M Thienotriazolodiazepines as platelet-activating factor antagonists. Steric limitations for the substituent in position 2. J Med Chem 34:1440-6 (1991)  
Target
Name:
Platelet-activating factor receptor
Synonyms:
PAF Platelet activating factor PAFR PTAFR_HUMAN Platelet-activating factor receptor
Type:
Enzyme Catalytic Domain
Mol. Mass.:
39219.60
Organism:
Homo sapiens (Human)
Description:
PAF Platelet activating factor PTAFR HUMAN::P25105
Residue:
342
  
Inhibitor
Name:
BDBM50011854
Synonyms:
4-(2-Chloro-phenyl)-2-indan-5-ylethynyl-9-methyl-6H-1-thia-5,7,8,9a-tetraaza-cyclopenta[e]azulene | CHEMBL284280
Type:
Small organic molecule
Emp. Form.:
C26H19ClN4S
Mol. Mass.:
454.974
SMILES:
Cc1nnc2CN=C(c3cc(sc3-n12)C#Cc1ccc2CCCc2c1)c1ccccc1Cl
: