Target
Platelet-activating factor receptor
Ligand
BDBM50011857
Substrate
Meas. Tech.
ChEBML_154999
IC50
80±n/a nM
Citation
 Walser, AFlynn, TMason, CCrowley, HMaresca, CO'Donnell, M Thienotriazolodiazepines as platelet-activating factor antagonists. Steric limitations for the substituent in position 2. J Med Chem 34:1440-6 (1991)  
Target
Name:
Platelet-activating factor receptor
Synonyms:
PAF Platelet activating factor PAFR PTAFR_HUMAN Platelet-activating factor receptor
Type:
Enzyme Catalytic Domain
Mol. Mass.:
39219.60
Organism:
Homo sapiens (Human)
Description:
PAF Platelet activating factor PTAFR HUMAN::P25105
Residue:
342
  
Inhibitor
Name:
BDBM50011857
Synonyms:
4-(2-Chloro-phenyl)-2-[2-(4-isobutyl-phenyl)-vinyl]-9-methyl-6H-1-thia-5,7,8,9a-tetraaza-cyclopenta[e]azulene | CHEMBL286229
Type:
Small organic molecule
Emp. Form.:
C27H25ClN4S
Mol. Mass.:
473.032
SMILES:
CC(C)Cc1ccc(\C=C/c2cc3c(s2)-n2c(C)nnc2CN=C3c2ccccc2Cl)cc1
: