Target
Platelet-activating factor receptor
Ligand
BDBM50011873
Substrate
Meas. Tech.
ChEBML_154999
IC50
400±n/a nM
Citation
 Walser, AFlynn, TMason, CCrowley, HMaresca, CO'Donnell, M Thienotriazolodiazepines as platelet-activating factor antagonists. Steric limitations for the substituent in position 2. J Med Chem 34:1440-6 (1991)  
Target
Name:
Platelet-activating factor receptor
Synonyms:
PAF Platelet activating factor PAFR PTAFR_HUMAN Platelet-activating factor receptor
Type:
Enzyme Catalytic Domain
Mol. Mass.:
39219.60
Organism:
Homo sapiens (Human)
Description:
PAF Platelet activating factor PTAFR HUMAN::P25105
Residue:
342
  
Inhibitor
Name:
BDBM50011873
Synonyms:
4-(2-Chloro-phenyl)-9-methyl-2-[2-(2,2,7-trimethyl-2,3-dihydro-benzofuran-5-yl)-ethyl]-6H-1-thia-5,7,8,9a-tetraaza-cyclopenta[e]azulene | CHEMBL286337
Type:
Small organic molecule
Emp. Form.:
C28H27ClN4OS
Mol. Mass.:
503.058
SMILES:
Cc1nnc2CN=C(c3cc(CCc4cc5CC(C)(C)Oc5c(C)c4)sc3-n12)c1ccccc1Cl
: