Target
Dihydrofolate reductase
Ligand
BDBM50011888
Substrate
Meas. Tech.
ChEBML_54103
IC50
50±n/a nM
Citation
 Rosowsky, AForsch, RABader, HFreisheim, JH Synthesis and in vitro biological activity of new deaza analogues of folic acid, aminopterin, and methotrexate with an L-ornithine side chain. J Med Chem 34:1447-54 (1991)  
Target
Name:
Dihydrofolate reductase
Synonyms:
DHFR Dihydrofolate reductase (DHFR) | Tetrahydrofolate dehydrogenase
Type:
Enzyme
Mol. Mass.:
21453.99
Organism:
Homo sapiens (Human)
Description:
Recombinant human DHFR.
Residue:
187
  
Inhibitor
Name:
BDBM50011888
Synonyms:
5-(Carboxymethyl-amino)-2-{4-[(2,4-diamino-pteridin-6-ylmethyl)-methyl-amino]-benzoylamino}-pentanoic acid | CHEMBL32691
Type:
Small organic molecule
Emp. Form.:
C22H27N9O5
Mol. Mass.:
497.5071
SMILES:
CN(Cc1cnc2nc(N)nc(N)c2n1)c1ccc(cc1)C(=O)NC(CCCNCC(O)=O)C(O)=O
: