Target
C5a anaphylatoxin chemotactic receptor 1
Ligand
BDBM50012291
Substrate
Meas. Tech.
ChEBML_41599
Ki
100000±n/a nM
Citation
 Kawai, MQuincy, DALane, BMollison, KWLuly, JRCarter, GW Identification and synthesis of a receptor binding site of human anaphylatoxin C5a. J Med Chem 34:2068-71 (1991)  
Target
Name:
C5a anaphylatoxin chemotactic receptor 1
Synonyms:
C5AR C5AR1_HUMAN C5a anaphylatoxin chemotactic receptor C5a-R | CD_antigen=CD88
Type:
Enzyme
Mol. Mass.:
39347.68
Organism:
Homo sapiens (Human)
Description:
P21730
Residue:
350
  
Inhibitor
Name:
BDBM50012291
Synonyms:
CHEMBL429238 | Phe-Thr-Glu-Met-Met-Val-Val-Ala-Ser-Gln-Leu-Alr-Ala-Asn-Ile-Ser-His-Lys-Asp-Met-Gln-Leu-Gly-Arg
Type:
Small organic molecule
Emp. Form.:
C117H196N36O35S3
Mol. Mass.:
2763.223
SMILES:
CC[C@H](C)[C@H](NC(=O)[C@H](CC(N)=O)NC(=O)[C@H](C)NC(=O)[C@H](CCCNC(N)=N)NC(=O)[C@H](CC(C)C)NC(=O)[C@H](CCC(N)=O)NC(=O)[C@H](CO)NC(=O)[C@H](C)NC(=O)[C@@H](NC(=O)[C@@H](NC(=O)[C@H](CCSC)NC(=O)[C@H](CCSC)NC(=O)[C@H](CCC(O)=O)NC(=O)[C@@H](NC(=O)[C@@H](N)Cc1ccccc1)[C@@H](C)O)C(C)C)C(C)C)C(=O)N[C@@H](CO)C(=O)N[C@@H](Cc1cnc[nH]1)C(=O)N[C@@H](CCCCN)C(=O)N[C@@H](CC(O)=O)C(=O)N[C@@H](CCSC)C(=O)N[C@@H](CCC(N)=O)C(=O)N[C@@H](CC(C)C)C(=O)NCC(=O)N[C@@H](CCCNC(N)=N)C(O)=O
: