Target
C5a anaphylatoxin chemotactic receptor 1
Ligand
BDBM50012294
Substrate
Meas. Tech.
ChEBML_41599
Ki
100000±n/a nM
Citation
 Kawai, MQuincy, DALane, BMollison, KWLuly, JRCarter, GW Identification and synthesis of a receptor binding site of human anaphylatoxin C5a. J Med Chem 34:2068-71 (1991)  
Target
Name:
C5a anaphylatoxin chemotactic receptor 1
Synonyms:
C5AR C5AR1_HUMAN C5a anaphylatoxin chemotactic receptor C5a-R | CD_antigen=CD88
Type:
Enzyme
Mol. Mass.:
39347.68
Organism:
Homo sapiens (Human)
Description:
P21730
Residue:
350
  
Inhibitor
Name:
BDBM50012294
Synonyms:
AcMet-Ile-Lys-Ala-Phe-Thr-Glu-Met-Met-Val-Val-Ala-Ser-Gln-Leu-Alr-Ala-Asn-Ile-Ser-His-Lys-Asp-Met-Gln-Leu-Gly-Arg | CHEMBL438915
Type:
Small organic molecule
Emp. Form.:
C139H235N41O40S4
Mol. Mass.:
3248.864
SMILES:
CC[C@H](C)[C@H](NC(=O)[C@H](CCSC)NC(C)=O)C(=O)N[C@@H](CCCCN)C(=O)N[C@@H](C)C(=O)N[C@@H](Cc1ccccc1)C(=O)N[C@@H]([C@@H](C)O)C(=O)N[C@@H](CCC(O)=O)C(=O)N[C@@H](CCSC)C(=O)N[C@@H](CCSC)C(=O)N[C@@H](C(C)C)C(=O)N[C@@H](C(C)C)C(=O)N[C@@H](C)C(=O)N[C@@H](CO)C(=O)N[C@@H](CCC(N)=O)C(=O)N[C@@H](CC(C)C)C(=O)N[C@@H](CCCNC(N)=N)C(=O)N[C@@H](C)C(=O)N[C@@H](CC(N)=O)C(=O)N[C@@H]([C@@H](C)CC)C(=O)N[C@@H](CO)C(=O)N[C@@H](Cc1cnc[nH]1)C(=O)N[C@@H](CCCCN)C(=O)N[C@@H](CC(O)=O)C(=O)N[C@@H](CCSC)C(=O)N[C@@H](CCC(N)=O)C(=O)N[C@@H](CC(C)C)C(=O)NCC(=O)N[C@@H](CCCNC(N)=N)C(O)=O
: