Target
Muscarinic acetylcholine receptor M2
Ligand
BDBM50012332
Substrate
Meas. Tech.
ChEBML_138164
Ki
1740±n/a nM
Citation
 Karton, YBradbury, BJBaumgold, JPaek, RJacobson, KA Functionalized congener approach to muscarinic antagonists: analogues of pirenzepine. J Med Chem 34:2133-45 (1991)  
Target
Name:
Muscarinic acetylcholine receptor M2
Synonyms:
ACM2_RAT Chrm-2 | Chrm2
Type:
Enzyme Catalytic Domain
Mol. Mass.:
51555.53
Organism:
RAT
Description:
P10980
Residue:
466
  
Inhibitor
Name:
BDBM50012332
Synonyms:
11-{2-[4-(4-Amino-butyl)-piperazin-1-yl]-acetyl}-5,11-dihydro-benzo[e]pyrido[3,2-b][1,4]diazepin-6-one | CHEMBL69796
Type:
Small organic molecule
Emp. Form.:
C22H28N6O2
Mol. Mass.:
408.4967
SMILES:
NCCCCN1CCN(CC(=O)N2c3ccccc3C(=O)Nc3cccnc23)CC1
: