Target
Muscarinic acetylcholine receptor M2
Ligand
BDBM50012327
Substrate
Meas. Tech.
ChEMBL_138163 (CHEMBL748227)
Ki
50±n/a nM
Citation
 Karton, YBradbury, BJBaumgold, JPaek, RJacobson, KA Functionalized congener approach to muscarinic antagonists: analogues of pirenzepine. J Med Chem 34:2133-45 (1991)  
Target
Name:
Muscarinic acetylcholine receptor M2
Synonyms:
ACM2_RAT Chrm-2 | Chrm2
Type:
Enzyme Catalytic Domain
Mol. Mass.:
51555.53
Organism:
RAT
Description:
P10980
Residue:
466
  
Inhibitor
Name:
BDBM50012327
Synonyms:
CHEMBL68292 | N-(9-{4-[2-Oxo-2-(6-oxo-5,6-dihydro-benzo[e]pyrido[3,2-b][1,4]diazepin-11-yl)-ethyl]-piperazin-1-yl}-nonyl)-acetamide
Type:
Small organic molecule
Emp. Form.:
C29H40N6O3
Mol. Mass.:
520.6663
SMILES:
CC(=O)NCCCCCCCCCN1CCN(CC(=O)N2c3ccccc3C(=O)Nc3cccnc23)CC1
: