Target
Muscarinic acetylcholine receptor M1
Ligand
BDBM50012328
Substrate
Meas. Tech.
ChEBML_139082
Ki
2840±n/a nM
Citation
 Karton, YBradbury, BJBaumgold, JPaek, RJacobson, KA Functionalized congener approach to muscarinic antagonists: analogues of pirenzepine. J Med Chem 34:2133-45 (1991)  
Target
Name:
Muscarinic acetylcholine receptor M1
Synonyms:
ACM1_RAT Chrm-1 cholinergic receptor, muscarinic 1
Type:
Enzyme Catalytic Domain
Mol. Mass.:
51390.46
Organism:
RAT
Description:
P08482
Residue:
460
  
Inhibitor
Name:
BDBM50012328
Synonyms:
CHEMBL304391 | N-Methyl-4-{4-[2-oxo-2-(6-oxo-5,6-dihydro-benzo[e]pyrido[3,2-b][1,4]diazepin-11-yl)-ethyl]-piperazin-1-ylmethyl}-benzamide
Type:
Small organic molecule
Emp. Form.:
C27H28N6O3
Mol. Mass.:
484.5496
SMILES:
CNC(=O)c1ccc(CN2CCN(CC(=O)N3c4ccccc4C(=O)Nc4cccnc34)CC2)cc1
: