Target
Muscarinic acetylcholine receptor M2
Ligand
BDBM50012358
Substrate
Meas. Tech.
ChEBML_138164
Ki
34500±n/a nM
Citation
 Karton, YBradbury, BJBaumgold, JPaek, RJacobson, KA Functionalized congener approach to muscarinic antagonists: analogues of pirenzepine. J Med Chem 34:2133-45 (1991)  
Target
Name:
Muscarinic acetylcholine receptor M2
Synonyms:
ACM2_RAT Chrm-2 | Chrm2
Type:
Enzyme Catalytic Domain
Mol. Mass.:
51555.53
Organism:
RAT
Description:
P10980
Residue:
466
  
Inhibitor
Name:
BDBM50012358
Synonyms:
3-Acetylamino-N-(2-{4-[2-oxo-2-(6-oxo-5,6-dihydro-benzo[e]pyrido[3,2-b][1,4]diazepin-11-yl)-ethyl]-piperazin-1-yl}-ethyl)-propionamide | CHEMBL422407
Type:
Small organic molecule
Emp. Form.:
C25H31N7O4
Mol. Mass.:
493.5581
SMILES:
CC(=O)NCCC(=O)NCCN1CCN(CC(=O)N2c3ccccc3C(=O)Nc3cccnc23)CC1
: