Target
Muscarinic acetylcholine receptor M2
Ligand
BDBM50012368
Substrate
Meas. Tech.
ChEBML_138164
Ki
2500±n/a nM
Citation
 Karton, YBradbury, BJBaumgold, JPaek, RJacobson, KA Functionalized congener approach to muscarinic antagonists: analogues of pirenzepine. J Med Chem 34:2133-45 (1991)  
Target
Name:
Muscarinic acetylcholine receptor M2
Synonyms:
ACM2_RAT Chrm-2 | Chrm2
Type:
Enzyme Catalytic Domain
Mol. Mass.:
51555.53
Organism:
RAT
Description:
P10980
Residue:
466
  
Inhibitor
Name:
BDBM50012368
Synonyms:
CHEMBL304109 | [2-(4-{4-[2-Oxo-2-(6-oxo-5,6-dihydro-benzo[e]pyrido[3,2-b][1,4]diazepin-11-yl)-ethyl]-piperazin-1-ylmethyl}-benzoylamino)-ethyl]-carbamic acid tert-butyl ester
Type:
Small organic molecule
Emp. Form.:
C33H39N7O5
Mol. Mass.:
613.7067
SMILES:
CC(C)(C)OC(=O)NCCNC(=O)c1ccc(CN2CCN(CC(=O)N3c4ccccc4C(=O)Nc4cccnc34)CC2)cc1
: