Target
Thymidylate synthase
Ligand
BDBM50012505
Substrate
Meas. Tech.
ChEBML_209810
IC50
10300±n/a nM
Citation
 Marsham, PRJackman, ALHayter, AJDaw, MRSnowden, JLO'Connor, BMBishop, JACalvert, AHHughes, LR Quinazoline antifolate thymidylate synthase inhibitors: bridge modifications and conformationally restricted analogues in the C2-methyl series. J Med Chem 34:2209-18 (1991)  
Target
Name:
Thymidylate synthase
Synonyms:
TS TYSY_MOUSE | Tyms
Type:
PROTEIN
Mol. Mass.:
34957.15
Organism:
Mus musculus
Description:
ChEMBL_1340097
Residue:
307
  
Inhibitor
Name:
BDBM50012505
Synonyms:
2-[4-(2-Methyl-4-oxo-3,4-dihydro-quinazolin-6-ylsulfanyl)-benzoylamino]-pentanedioic acid | CHEMBL72049
Type:
Small organic molecule
Emp. Form.:
C21H19N3O6S
Mol. Mass.:
441.457
SMILES:
Cc1nc2ccc(Sc3ccc(cc3)C(=O)N[C@@H](CCC(O)=O)C(O)=O)cc2c(=O)[nH]1
: