Target
Thymidylate synthase
Ligand
BDBM50012514
Substrate
Meas. Tech.
ChEBML_209810
IC50
720±n/a nM
Citation
 Marsham, PRJackman, ALHayter, AJDaw, MRSnowden, JLO'Connor, BMBishop, JACalvert, AHHughes, LR Quinazoline antifolate thymidylate synthase inhibitors: bridge modifications and conformationally restricted analogues in the C2-methyl series. J Med Chem 34:2209-18 (1991)  
Target
Name:
Thymidylate synthase
Synonyms:
TS TYSY_MOUSE | Tyms
Type:
PROTEIN
Mol. Mass.:
34957.15
Organism:
Mus musculus
Description:
ChEMBL_1340097
Residue:
307
  
Inhibitor
Name:
BDBM50012514
Synonyms:
2-{5-[Methyl-(2-methyl-4-oxo-3,4-dihydro-quinazolin-6-ylmethyl)-amino]-1-oxo-1,3-dihydro-isoindol-2-yl}-pentanedioic acid | CHEMBL307949
Type:
Small organic molecule
Emp. Form.:
C24H24N4O6
Mol. Mass.:
464.4706
SMILES:
CN(Cc1ccc2nc(C)[nH]c(=O)c2c1)c1ccc2C(=O)N(Cc2c1)[C@@H](CCC(O)=O)C(O)=O
: