Target
Prostaglandin G/H synthase 1/2
Ligand
BDBM50228722
Substrate
Meas. Tech.
ChEMBL_158567 (CHEMBL769240)
IC50
400±n/a nM
Citation
 Walsh, DAMoran, HWShamblee, DAWelstead, WJNolan, JCSancilio, LFGraff, G Antiinflammatory agents. 4. Syntheses and biological evaluation of potential prodrugs of 2-amino-3-benzoylbenzeneacetic acid and 2-amino-3-(4-chlorobenzoyl)benzeneacetic acid. J Med Chem 33:2296-304 (1990)  
Target
Name:
Prostaglandin G/H synthase 1/2
Synonyms:
Cyclooxygenase
Type:
Mol. Mass.:
Description:
ASSAY_ID of ChEMBL is 1666355
Components:
This complex has 2 components.
Component 1
Name:
Prostaglandin G/H synthase 2
Synonyms:
Cox-2 Cyclooxygenase Ptgs2
Type:
Enzyme Catalytic Domain
Mol. Mass.:
69173.51
Organism:
RAT
Description:
COX-2 0 RAT::P35355
Residue:
604
  
Component 2
Name:
Prostaglandin G/H synthase 1
Synonyms:
Cox-1 Cyclooxygenase PGH1_RAT Ptgs1
Type:
Enzyme Catalytic Domain
Mol. Mass.:
69033.56
Organism:
RAT
Description:
COX-1 0 RAT::Q63921
Residue:
602
  
Inhibitor
Name:
BDBM50228722
Synonyms:
CHEMBL75896
Type:
Small organic molecule
Emp. Form.:
C15H18NNaO3
Mol. Mass.:
283.2981
SMILES:
[Na+].Nc1c(CC([O-])=O)cccc1C(=O)C1CCCCC1
: