Target
Renin
Ligand
BDBM50012925
Substrate
Meas. Tech.
ChEBML_195977
IC50
3.7±n/a nM
Citation
 Roberts, DABradbury, RHBrown, DFaull, AGriffiths, DMajor, JSOldham, AAPearce, RJRatcliffe, AHRevill, J 1,2,4-Triazolo[4,3-a]pyrazine derivatives with human renin inhibitory activity. 1. Synthesis and biological properties of alkyl alcohol and statine derivatives. J Med Chem 33:2326-34 (1990)  
Target
Name:
Renin
Synonyms:
Angiotensinogenase RENI_HUMAN
Type:
Enzyme
Mol. Mass.:
45058.99
Organism:
Homo sapiens (Human)
Description:
Residue:
406
  
Inhibitor
Name:
BDBM50012925
Synonyms:
2-Amino-6-(1-{1-cyclohexylmethyl-2-hydroxy-4-[2-(8-isobutyl-6-phenyl-[1,2,4]triazolo[4,3-a]pyrazin-3-yl)-3-pyridin-3-yl-propionylamino]-4-oxo-butylcarbamoyl}-3-methyl-butylamino)-hexanoic acid . 4H2O | CHEMBL424423
Type:
Small organic molecule
Emp. Form.:
C46H65N9O6
Mol. Mass.:
840.065
SMILES:
CC(C)CC(NCCCC[C@H](N)C(O)=O)C(=O)N[C@@H](CC1CCCCC1)[C@@H](O)CC(=O)NC(=O)C(Cc1cccnc1)c1nnc2c(CC(C)C)nc(cn12)-c1ccccc1
: