Target
Renin
Ligand
BDBM50012928
Substrate
Meas. Tech.
ChEBML_195977
IC50
1.6±n/a nM
Citation
 Roberts, DABradbury, RHBrown, DFaull, AGriffiths, DMajor, JSOldham, AAPearce, RJRatcliffe, AHRevill, J 1,2,4-Triazolo[4,3-a]pyrazine derivatives with human renin inhibitory activity. 1. Synthesis and biological properties of alkyl alcohol and statine derivatives. J Med Chem 33:2326-34 (1990)  
Target
Name:
Renin
Synonyms:
Angiotensinogenase RENI_HUMAN
Type:
Enzyme
Mol. Mass.:
45058.99
Organism:
Homo sapiens (Human)
Description:
Residue:
406
  
Inhibitor
Name:
BDBM50012928
Synonyms:
2-(3-Aminomethyl-benzylamino)-4-methyl-pentanoic acid {1-cyclohexylmethyl-2-hydroxy-4-oxo-4-[2-(8-propyl-6-pyridin-3-yl-[1,2,4]triazolo[4,3-a]pyrazin-3-yl)-3-pyridin-3-yl-propionylamino]-butyl}-amide. 5H2O | CHEMBL307389
Type:
Small organic molecule
Emp. Form.:
C46H60N10O4
Mol. Mass.:
817.0332
SMILES:
CCCc1nc(cn2c(nnc12)C(Cc1cccnc1)C(=O)NC(=O)C[C@H](O)[C@H](CC1CCCCC1)NC(=O)C(CC(C)C)NCc1cccc(CN)c1)-c1cccnc1
: