Target
Renin
Ligand
BDBM50012923
Substrate
Meas. Tech.
ChEMBL_195977 (CHEMBL807683)
IC50
1.70±n/a nM
Citation
 Roberts, DABradbury, RHBrown, DFaull, AGriffiths, DMajor, JSOldham, AAPearce, RJRatcliffe, AHRevill, J 1,2,4-Triazolo[4,3-a]pyrazine derivatives with human renin inhibitory activity. 1. Synthesis and biological properties of alkyl alcohol and statine derivatives. J Med Chem 33:2326-34 (1990)  
Target
Name:
Renin
Synonyms:
Angiotensinogenase RENI_HUMAN
Type:
Enzyme
Mol. Mass.:
45058.99
Organism:
Homo sapiens (Human)
Description:
Residue:
406
  
Inhibitor
Name:
BDBM50012923
Synonyms:
2-(3-Aminomethyl-benzylamino)-4-methyl-pentanoic acid {1-cyclohexylmethyl-2-hydroxy-4-[2-(8-isobutyl-6-phenyl-[1,2,4]triazolo[4,3-a]pyrazin-3-yl)-3-pyridin-3-yl-propionylamino]-4-oxo-butyl}-amide CHEMBL307912
Type:
Small organic molecule
Emp. Form.:
C48H63N9O4
Mol. Mass.:
830.0717
SMILES:
CC(C)CC(NCc1cccc(CN)c1)C(=O)NC(CC1CCCCC1)C(O)CC(=O)NC(=O)C(Cc1cccnc1)c1nnc2c(CC(C)C)nc(cn12)-c1ccccc1
: