Target
Receptor tyrosine-protein kinase erbB-2
Ligand
BDBM50357312
Substrate
Meas. Tech.
ChEMBL_1706883 (CHEMBL4058116)
IC50
9.4±n/a nM
Citation
 He, LLi, DZhang, CBai, PChen, L Discovery of (R)-5-(benzo[d][1,3]dioxol-5-yl)-7-((1-(vinylsulfonyl)pyrrolidin-2-yl)methyl)-7H-pyrrolo[2,3-d]pyrimidin-4-amine (B6) as a potent Bmx inhibitor for the treatment of NSCLC. Bioorg Med Chem Lett 27:4171-4175 (2017)  
Target
Name:
Receptor tyrosine-protein kinase erbB-2
Synonyms:
2.7.10.1 CD_antigen=CD340 ERBB2_HUMAN FASN/HER2 HER2 MLN19 NEU Proto-oncogene Neu Tyrosine kinase-type cell surface receptor HER2 | p185erbB2
Type:
Mol. Mass.:
137894.47
Organism:
Homo sapiens (Human)
Description:
P04626
Residue:
1255
  
Inhibitor
Name:
BDBM50357312
Synonyms:
IBRUTINIB US10124003, Ref. Ex. Compound 1 US10793575, Example ibrutinib US10919899, Ibrutinib US11186578, Example Ibrutinib US11407754, Example Ibrutinib US9108973, Ref 1 US9278100, 1
Type:
Small organic molecule
Emp. Form.:
C25H24N6O2
Mol. Mass.:
440.4971
SMILES:
Nc1ncnc2n(nc(-c3ccc(Oc4ccccc4)cc3)c12)[C@@H]1CCCN(C1)C(=O)C=C
: