Target
D(2) dopamine receptor
Ligand
BDBM52987
Substrate
Meas. Tech.
ChEBML_58550
IC50
0.320000±n/a nM
Citation
 Neumeyer, JLGao, YGKula, NSBaldessarini, RJ Synthesis and dopamine receptor affinity of (R)-(-)-2-fluoro-N-n-propylnorapomorphine: a highly potent and selective dopamine D2 agonist. J Med Chem 33:3122-4 (1991)  
Target
Name:
D(2) dopamine receptor
Synonyms:
DOPAMINE D2 DOPAMINE D2 Short Dopamine D2 receptor Drd2
Type:
G Protein-Coupled Receptor (GPCR)
Mol. Mass.:
50931.60
Organism:
Rattus norvegicus (rat)
Description:
P61169
Residue:
444
  
Inhibitor
Name:
BDBM52987
Synonyms:
(6aR)-6-propyl-5,6,6a,7-tetrahydro-4H-dibenzo[de,g]quinoline-2,10,11-triol;hydrate;hydrobromide CHEMBL288096 R( )-2,10,11-Trihydroxy-N-propyl-noraporphine hydrobromide hydrate cid_23640911
Type:
Small organic molecule
Emp. Form.:
C19H21NO3
Mol. Mass.:
311.3749
SMILES:
CCCN1CCc2cc(O)cc-3c2[C@H]1Cc1ccc(O)c(O)c-31
: