Target
3-hydroxy-3-methylglutaryl-coenzyme A reductase
Ligand
BDBM50013217
Substrate
Meas. Tech.
ChEBML_80477
IC50
0.018000±n/a nM
Citation
 Jendralla, HBaader, EBartmann, WBeck, GBergmann, AGranzer, Evon Kerekjarto, BKesseler, KKrause, RSchubert, W Synthesis and biological activity of new HMG-CoA reductase inhibitors. 2. Derivatives of 7-(1H-pyrrol-3-yl)-substituted-3,5-dihydroxyhept-6(E)-enoic (-heptanoic) acids. J Med Chem 33:61-70 (1990)  
Target
Name:
3-hydroxy-3-methylglutaryl-coenzyme A reductase
Synonyms:
3-hydroxy-3-methylglutaryl-coenzyme A (HMG-CoA) reductase HMDH_HUMAN HMG-CoA reductase (HMGR) | HMGCR
Type:
Enzyme
Mol. Mass.:
97477.10
Organism:
Homo sapiens (Human)
Description:
P04035
Residue:
888
  
Inhibitor
Name:
BDBM50013217
Synonyms:
CHEMBL159951 | Sodium salt of7-[1-Cyclohexyl-4-(4-fluoro-phenyl)-2-isopropyl-1H-pyrrol-3-yl]-3,5-dihydroxy-heptanoic acid
Type:
Small organic molecule
Emp. Form.:
C26H35FNO4
Mol. Mass.:
444.5594
SMILES:
CC(C)c1c(CC[C@@H](O)C[C@@H](O)CC([O-])=O)c(cn1C1CCCCC1)-c1ccc(F)cc1
: