Target
Cytochrome P450 2D6
Ligand
BDBM50121975
Substrate
Meas. Tech.
ChEMBL_1709453 (CHEMBL4119502)
IC50
135±n/a nM
Citation
 Zhao, SZhang, XWei, PSu, XZhao, LWu, MHao, CLiu, CZhao, DCheng, M Design, synthesis and evaluation of aromatic heterocyclic derivatives as potent antifungal agents. Eur J Med Chem 137:96-107 (2017)  
Target
Name:
Cytochrome P450 2D6
Synonyms:
CP2D6_HUMAN CYP2DL1 Cytochrome P450 2D6 (CYP2D6) P450-DB1
Type:
Protein
Mol. Mass.:
55774.82
Organism:
Homo sapiens (Human)
Description:
P10635
Residue:
497
  
Inhibitor
Name:
BDBM50121975
Synonyms:
(6-Methoxy-quinolin-4-yl)-(5-vinyl-1-aza-bicyclo[2.2.2]oct-2-yl)-methanol CHEMBL1294 DURAQUIN QUINAGLUTE QUINATIME QUINIDINE US9402878, Quinidine
Type:
Small organic molecule
Emp. Form.:
C20H24N2O2
Mol. Mass.:
324.4168
SMILES:
COc1ccc2nccc([C@H](O)[C@H]3C[C@@H]4CCN3C[C@@H]4C=C)c2c1
: