Target
Renin
Ligand
BDBM50014061
Substrate
Meas. Tech.
ChEMBL_195940 (CHEMBL801666)
IC50
3.1±n/a nM
Citation
 Rosenberg, SHDellaria, JFKempf, DJHutchins, CWWoods, KWMaki, RGde Lara, ESpina, KPStein, HHCohen, J Potent, low molecular weight renin inhibitors containing a C-terminal heterocycle: hydrogen bonding at the active site. J Med Chem 33:1582-90 (1990)  
Target
Name:
Renin
Synonyms:
Angiotensinogenase RENI_HUMAN
Type:
Enzyme
Mol. Mass.:
45058.99
Organism:
Homo sapiens (Human)
Description:
Residue:
406
  
Inhibitor
Name:
BDBM50014061
Synonyms:
CHEMBL288411 | {1-[1-[1-Cyclohexylmethyl-2-hydroxy-2-(2-oxo-[1,3]oxazinan-6-yl)-ethylcarbamoyl]-2-(3H-imidazol-4-yl)-ethylcarbamoyl]-2-phenyl-ethyl}-carbamic acid tert-butyl ester
Type:
Small organic molecule
Emp. Form.:
C33H48N6O7
Mol. Mass.:
640.7702
SMILES:
CC(C)(C)OC(=O)N[C@@H](Cc1ccccc1)C(=O)N[C@@H](Cc1cnc[nH]1)C(=O)N[C@@H](CC1CCCCC1)[C@@H](O)[C@@H]1CCNC(=O)O1
: