Target
Renin
Ligand
BDBM50014138
Substrate
Meas. Tech.
ChEBML_195951
IC50
750±n/a nM
Citation
 Dutta, ASGormley, JJMcLachlan, PFMajor, JS Inhibitors of human renin. Cyclic peptide analogues containing a D-Phe-Lys-D-Trp sequence. J Med Chem 33:2560-8 (1990)  
Target
Name:
Renin
Synonyms:
Angiotensinogenase RENI_HUMAN
Type:
Enzyme
Mol. Mass.:
45058.99
Organism:
Homo sapiens (Human)
Description:
Residue:
406
  
Inhibitor
Name:
BDBM50014138
Synonyms:
6-Amino-2-(3,6-dibenzyl-7-methyl-2,5,9-trioxo-[1,4]diazonan-1-yl)-hexanoic acid [2-(1H-indol-3-yl)-1-(3-methyl-butylcarbamoyl)-ethyl]-amide | CHEMBL315673
Type:
Small organic molecule
Emp. Form.:
C42H53N7O5
Mol. Mass.:
735.9141
SMILES:
CC(C)CCNC(=O)[C@H](Cc1c[nH]c2ccccc12)NC(=O)[C@H](CCCCN)N1C(=O)CN[C@@H](Cc2ccccc2)C(=O)N[C@@H](Cc2ccccc2)C1=O
: