Target
5-hydroxytryptamine receptor 1A
Ligand
BDBM50014215
Substrate
Meas. Tech.
ChEBML_1314
Ki
>10000±n/a nM
Citation
 Glennon, RAChaurasia, CTiteler, M Binding of indolylalkylamines at 5-HT2 serotonin receptors: examination of a hydrophobic binding region. J Med Chem 33:2777-84 (1990)  
Target
Name:
5-hydroxytryptamine receptor 1A
Synonyms:
5-HT-1A 5-HT1A 5-hydroxytryptamine receptor 1A (5HT1A) 5ht1a Htr1a Serotonin 1a (5-HT1a) receptor/Adrenergic receptor alpha-1 | Serotonin receptor 1A
Type:
G Protein-Coupled Receptor (GPCR)
Mol. Mass.:
46445.29
Organism:
Rattus norvegicus (rat)
Description:
Binding assays were performed using rat hippocampal membranes.
Residue:
422
  
Inhibitor
Name:
BDBM50014215
Synonyms:
1-Methyl-2-(1H-pyrrol-3-yl)-ethylamine | CHEMBL328939
Type:
Small organic molecule
Emp. Form.:
C7H12N2
Mol. Mass.:
124.1836
SMILES:
CC(N)Cc1cc[nH]c1
: