Target
5-hydroxytryptamine receptor 1A
Ligand
BDBM50014221
Substrate
Meas. Tech.
ChEBML_1314
Ki
2400±n/a nM
Citation
 Glennon, RAChaurasia, CTiteler, M Binding of indolylalkylamines at 5-HT2 serotonin receptors: examination of a hydrophobic binding region. J Med Chem 33:2777-84 (1990)  
Target
Name:
5-hydroxytryptamine receptor 1A
Synonyms:
5-HT-1A 5-HT1A 5-hydroxytryptamine receptor 1A (5HT1A) 5ht1a Htr1a Serotonin 1a (5-HT1a) receptor/Adrenergic receptor alpha-1 | Serotonin receptor 1A
Type:
G Protein-Coupled Receptor (GPCR)
Mol. Mass.:
46445.29
Organism:
Rattus norvegicus (rat)
Description:
Binding assays were performed using rat hippocampal membranes.
Residue:
422
  
Inhibitor
Name:
BDBM50014221
Synonyms:
1-Methyl-2-(1-pentyl-1H-indol-3-yl)-ethylamine | CHEMBL92619
Type:
Small organic molecule
Emp. Form.:
C16H24N2
Mol. Mass.:
244.3752
SMILES:
CCCCCn1cc(CC(C)N)c2ccccc12
: