Target
Thymidylate synthase
Ligand
BDBM50006691
Substrate
Meas. Tech.
ChEBML_209971
IC50
300±n/a nM
Citation
 Hughes, LRJackman, ALOldfield, JSmith, RCBurrows, KDMarsham, PRBishop, JAJones, TRO'Connor, BMCalvert, AH Quinazoline antifolate thymidylate synthase inhibitors: alkyl, substituted alkyl, and aryl substituents in the C2 position. J Med Chem 33:3060-7 (1990)  
Target
Name:
Thymidylate synthase
Synonyms:
TS TYSY_MOUSE | Tyms
Type:
PROTEIN
Mol. Mass.:
34957.15
Organism:
Mus musculus
Description:
ChEMBL_1340097
Residue:
307
  
Inhibitor
Name:
BDBM50006691
Synonyms:
(S)-2-(4-(methyl((2-methyl-4-oxo-3,4-dihydroquinazolin-6-yl)methyl)amino)benzamido)pentanedioic acid 2-{4-[Methyl-(2-methyl-4-oxo-3,4-dihydro-quinazolin-6-ylmethyl)-amino]-benzoylamino}-pentanedioic acid ;hydrate(0.75H2O) | CHEMBL40321
Type:
Small organic molecule
Emp. Form.:
C23H24N4O6
Mol. Mass.:
452.4599
SMILES:
CN(Cc1ccc2nc(C)[nH]c(=O)c2c1)c1ccc(cc1)C(=O)N[C@@H](CCC(O)=O)C(O)=O
: