Target
Thymidylate synthase
Ligand
BDBM50014485
Substrate
Meas. Tech.
ChEBML_209971
IC50
100±n/a nM
Citation
 Hughes, LRJackman, ALOldfield, JSmith, RCBurrows, KDMarsham, PRBishop, JAJones, TRO'Connor, BMCalvert, AH Quinazoline antifolate thymidylate synthase inhibitors: alkyl, substituted alkyl, and aryl substituents in the C2 position. J Med Chem 33:3060-7 (1990)  
Target
Name:
Thymidylate synthase
Synonyms:
TS TYSY_MOUSE | Tyms
Type:
PROTEIN
Mol. Mass.:
34957.15
Organism:
Mus musculus
Description:
ChEMBL_1340097
Residue:
307
  
Inhibitor
Name:
BDBM50014485
Synonyms:
(S)-2-(4-(((2-(hydroxymethyl)-4-oxo-3,4-dihydroquinazolin-6-yl)methyl)(prop-2-ynyl)amino)benzamido)pentanedioic acid CHEMBL321977
Type:
Small organic molecule
Emp. Form.:
C25H24N4O7
Mol. Mass.:
492.4807
SMILES:
OCc1nc2ccc(CN(CC#C)c3ccc(cc3)C(=O)N[C@@H](CCC(O)=O)C(O)=O)cc2c(=O)[nH]1
: