Target
Thymidylate synthase
Ligand
BDBM50014489
Substrate
Meas. Tech.
ChEBML_209971
IC50
260±n/a nM
Citation
 Hughes, LRJackman, ALOldfield, JSmith, RCBurrows, KDMarsham, PRBishop, JAJones, TRO'Connor, BMCalvert, AH Quinazoline antifolate thymidylate synthase inhibitors: alkyl, substituted alkyl, and aryl substituents in the C2 position. J Med Chem 33:3060-7 (1990)  
Target
Name:
Thymidylate synthase
Synonyms:
TS TYSY_MOUSE | Tyms
Type:
PROTEIN
Mol. Mass.:
34957.15
Organism:
Mus musculus
Description:
ChEMBL_1340097
Residue:
307
  
Inhibitor
Name:
BDBM50014489
Synonyms:
(S)-2-(4-(ethyl((2-(hydroxymethyl)-4-oxo-3,4-dihydroquinazolin-6-yl)methyl)amino)benzamido)pentanedioic acid CHEMBL104483
Type:
Small organic molecule
Emp. Form.:
C24H26N4O7
Mol. Mass.:
482.4858
SMILES:
CCN(Cc1ccc2nc(CO)[nH]c(=O)c2c1)c1ccc(cc1)C(=O)N[C@@H](CCC(O)=O)C(O)=O
: