Target
Thymidylate synthase
Ligand
BDBM50014521
Substrate
Meas. Tech.
ChEBML_209796
IC50
940.0±n/a nM
Citation
 Marsham, PRJackman, ALOldfield, JHughes, LRThornton, TJBisset, GMO'Connor, BMBishop, JACalvert, AH Quinazoline antifolate thymidylate synthase inhibitors: benzoyl ring modifications in the C2-methyl series. J Med Chem 33:3072-8 (1990)  
Target
Name:
Thymidylate synthase
Synonyms:
TS TYSY_MOUSE | Tyms
Type:
PROTEIN
Mol. Mass.:
34957.15
Organism:
Mus musculus
Description:
ChEMBL_1340097
Residue:
307
  
Inhibitor
Name:
BDBM50014521
Synonyms:
(S)-2-(2-methyl-4-(methyl((2-methyl-4-oxo-3,4-dihydroquinazolin-6-yl)methyl)amino)benzamido)pentanedioic acid CHEMBL320470
Type:
Small organic molecule
Emp. Form.:
C24H26N4O6
Mol. Mass.:
466.4864
SMILES:
CN(Cc1ccc2nc(C)[nH]c(=O)c2c1)c1ccc(C(=O)N[C@@H](CCC(O)=O)C(O)=O)c(C)c1
: