Target
Delta-type opioid receptor
Ligand
BDBM50274740
Substrate
Meas. Tech.
ChEMBL_1714216 (CHEMBL4124265)
IC50
309±n/a nM
Citation
 Willemse, TEiselt, EHollanders, KSchepens, Wvan Vlijmen, HWTChung, NNBlais, VHolleran, BLongpré, JMSchiller, PWMaes, BUWSarret, PGendron, LBallet, S Chemical space screening around Phe Bioorg Med Chem Lett 28:2320-2323 (2018)  
Target
Name:
Delta-type opioid receptor
Synonyms:
DOR-1 MSL-2 OPRD_MOUSE Oprd1
Type:
Enzyme Catalytic Domain
Mol. Mass.:
40577.25
Organism:
MOUSE
Description:
P32300
Residue:
372
  
Inhibitor
Name:
BDBM50274740
Synonyms:
CHEMBL4128463
Type:
Small organic molecule
Emp. Form.:
C32H42N8O5S
Mol. Mass.:
650.791
SMILES:
Cc1cc(O)cc(C)c1C[C@H](N)C(=O)N[C@H](CCCNC(N)=N)C(=O)N[C@@H](Cc1ccc(cc1)-c1ccsc1)C(=O)NCC(N)=O
: