Target
Mu-type opioid receptor
Ligand
BDBM50274732
Substrate
Meas. Tech.
ChEMBL_1714215 (CHEMBL4124264)
IC50
0.470000±n/a nM
Citation
 Willemse, TEiselt, EHollanders, KSchepens, Wvan Vlijmen, HWTChung, NNBlais, VHolleran, BLongpré, JMSchiller, PWMaes, BUWSarret, PGendron, LBallet, S Chemical space screening around Phe Bioorg Med Chem Lett 28:2320-2323 (2018)  
Target
Name:
Mu-type opioid receptor
Synonyms:
M-OR-1 Mor OPRM_MOUSE Oprm | Oprm1
Type:
Enzyme Catalytic Domain
Mol. Mass.:
44431.62
Organism:
MOUSE
Description:
OPIATE Mu OPRM1 MOUSE::P42866
Residue:
398
  
Inhibitor
Name:
BDBM50274732
Synonyms:
CHEMBL4127547
Type:
Small organic molecule
Emp. Form.:
C28H39FN8O5
Mol. Mass.:
586.6583
SMILES:
Cc1cc(O)cc(C)c1C[C@H](N)C(=O)N[C@H](CCCNC(N)=N)C(=O)N[C@@H](Cc1ccc(F)cc1)C(=O)NCC(N)=O
: