Target
Tumor necrosis factor
Ligand
BDBM60918
Substrate
Meas. Tech.
ChEMBL_1715329 (CHEMBL4125378)
IC50
20600000±n/a nM
Citation
 Kadayat, TMBanskota, SBist, GGurung, PMagar, TBTShrestha, AKim, JALee, ES Synthesis and biological evaluation of pyridine-linked indanone derivatives: Potential agents for inflammatory bowel disease. Bioorg Med Chem Lett 28:2436-2441 (2018)  
Target
Name:
Tumor necrosis factor
Synonyms:
Cachectin TNF-a TNFA TNFSF2 Tumor necrosis factor (TNFa) Tumor necrosis factor ligand superfamily member 2 Tumor necrosis factor, soluble form | tumor necrosis factor alpha
Type:
Enzyme
Mol. Mass.:
25645.11
Organism:
Homo sapiens (Human)
Description:
P01375
Residue:
233
  
Inhibitor
Name:
BDBM60918
Synonyms:
5-Amino-2-hydroxy-benzoic acid MLS001424012 cid_4075
Type:
Small organic molecule
Emp. Form.:
C7H7NO3
Mol. Mass.:
153.1354
SMILES:
Nc1ccc(O)c(c1)C(O)=O
: