Target
Dihydrofolate reductase
Ligand
BDBM50014707
Substrate
Meas. Tech.
ChEMBL_54598 (CHEMBL667321)
Ki
0.005200±n/a nM
Citation
 DeGraw, JIChristie, PHKisliuk, RLGaumont, YSirotnak, FM Synthesis and antifolate properties of 9-alkyl-10-deazaminopterins. J Med Chem 33:212-5 (1990)  
Target
Name:
Dihydrofolate reductase
Synonyms:
DYR_MOUSE | Dhfr
Type:
Enzyme
Mol. Mass.:
21608.82
Organism:
Mus musculus (Mouse)
Description:
Residue:
187
  
Inhibitor
Name:
BDBM50014707
Synonyms:
2-{4-[2-(2,4-Diamino-pteridin-6-yl)-propyl]-benzoylamino}-pentanedioic acid | CHEMBL431359
Type:
Small organic molecule
Emp. Form.:
C21H23N7O5
Mol. Mass.:
453.4512
SMILES:
CC(Cc1ccc(cc1)C(=O)NC(CCC(O)=O)C(O)=O)c1cnc2nc(N)nc(N)c2n1
: