Target
Cathepsin G
Ligand
BDBM50014731
Substrate
Meas. Tech.
ChEBML_45359
Ki
7000±n/a nM
Citation
 Peet, NPBurkhart, JPAngelastro, MRGiroux, ELMehdi, SBey, PKolb, MNeises, BSchirlin, D Synthesis of peptidyl fluoromethyl ketones and peptidyl alpha-keto esters as inhibitors of porcine pancreatic elastase, human neutrophil elastase, and rat and human neutrophil cathepsin G. J Med Chem 33:394-407 (1990)  
Target
Name:
Cathepsin G
Synonyms:
CATG_HUMAN CTSG
Type:
PROTEIN
Mol. Mass.:
28860.08
Organism:
Homo sapiens (Human)
Description:
ChEMBL_1469016
Residue:
255
  
Inhibitor
Name:
BDBM50014731
Synonyms:
3-[(1-{2-[2-(3-Methoxycarbonyl-propionylamino)-propionylamino]-propionyl}-pyrrolidine-2-carbonyl)-amino]-2-oxo-4-phenyl-butyric acid methyl ester | CHEMBL130006
Type:
Small organic molecule
Emp. Form.:
C27H36N4O9
Mol. Mass.:
560.5961
SMILES:
COC(=O)CCC(=O)N[C@@H](C)C(=O)N[C@@H](C)C(=O)N1CCC[C@H]1C(=O)N[C@@H](Cc1ccccc1)C(=O)C(=O)OC
: