Target
Cathepsin G
Ligand
BDBM50014742
Substrate
Meas. Tech.
ChEBML_45359
Ki
>800000±n/a nM
Citation
 Peet, NPBurkhart, JPAngelastro, MRGiroux, ELMehdi, SBey, PKolb, MNeises, BSchirlin, D Synthesis of peptidyl fluoromethyl ketones and peptidyl alpha-keto esters as inhibitors of porcine pancreatic elastase, human neutrophil elastase, and rat and human neutrophil cathepsin G. J Med Chem 33:394-407 (1990)  
Target
Name:
Cathepsin G
Synonyms:
CATG_HUMAN CTSG
Type:
PROTEIN
Mol. Mass.:
28860.08
Organism:
Homo sapiens (Human)
Description:
ChEMBL_1469016
Residue:
255
  
Inhibitor
Name:
BDBM50014742
Synonyms:
Acetyl-Ala-Ala-Pro-Ala-trifluromethane | CHEMBL130128
Type:
Small organic molecule
Emp. Form.:
C17H25F3N4O5
Mol. Mass.:
422.3994
SMILES:
C[C@H](NC(C)=O)C(=O)N[C@@H](C)C(=O)N1CCC[C@H]1C(=O)N[C@@H](C)C(=O)C(F)(F)F
: