Target
Neutrophil elastase
Ligand
BDBM50014732
Substrate
Meas. Tech.
ChEMBL_63628 (CHEMBL675339)
Ki
6.3±n/a nM
Citation
 Peet, NPBurkhart, JPAngelastro, MRGiroux, ELMehdi, SBey, PKolb, MNeises, BSchirlin, D Synthesis of peptidyl fluoromethyl ketones and peptidyl alpha-keto esters as inhibitors of porcine pancreatic elastase, human neutrophil elastase, and rat and human neutrophil cathepsin G. J Med Chem 33:394-407 (1990)  
Target
Name:
Neutrophil elastase
Synonyms:
Bone marrow serine protease Coagulation factor X ELANE Elastase HLE Leukocyte elastase Medullasin Neutrophil elastase (HNE) PMN elastase Trypsin
Type:
Enzyme
Mol. Mass.:
28532.38
Organism:
Homo sapiens (Human)
Description:
P08246
Residue:
267
  
Inhibitor
Name:
BDBM50014732
Synonyms:
1-{2-[2-(5-Dimethylamino-naphthalene-1-sulfonylamino)-propionylamino]-propionyl}-pyrrolidine-2-carboxylic acid (3,3,3-trifluoro-1-isopropyl-2-oxo-propyl)-amide | CHEMBL339870
Type:
Small organic molecule
Emp. Form.:
C29H38F3N5O6S
Mol. Mass.:
641.702
SMILES:
CC(C)[C@H](NC(=O)[C@@H]1CCCN1C(=O)[C@H](C)NC(=O)[C@H](C)NS(=O)(=O)c1cccc2c(cccc12)N(C)C)C(=O)C(F)(F)F
: