Target
3-hydroxy-3-methylglutaryl-coenzyme A reductase
Ligand
BDBM50014827
Substrate
Meas. Tech.
ChEBML_80667
IC50
94±n/a nM
Citation
 Beck, GKesseler, KBaader, EBartmann, WBergmann, AGranzer, EJendralla, Hvon Kerekjarto, BKrause, RPaulus, E Synthesis and biological activity of new HMG-CoA reductase inhibitors. 1. Lactones of pyridine- and pyrimidine-substituted 3,5-dihydroxy-6-heptenoic (-heptanoic) acids. J Med Chem 33:52-60 (1990)  
Target
Name:
3-hydroxy-3-methylglutaryl-coenzyme A reductase
Synonyms:
HMDH_RAT Hmgcr
Type:
Enzyme
Mol. Mass.:
96689.85
Organism:
Rattus norvegicus (rat)
Description:
Isolated rat liver microsomes were used as enzyme source.
Residue:
887
  
Inhibitor
Name:
BDBM50014827
Synonyms:
(E)-6-{2-[4-(4-Chloro-phenyl)-2,6-dimethyl-pyridin-3-yl]-vinyl}-4-hydroxy-tetrahydro-pyran-2-one | CHEMBL2368196
Type:
Small organic molecule
Emp. Form.:
C20H20ClNO3
Mol. Mass.:
357.831
SMILES:
Cc1cc(-c2ccc(Cl)cc2)c(\C=C\[C@@H]2C[C@@H](O)CC(=O)O2)c(C)n1
: