Target
3-hydroxy-3-methylglutaryl-coenzyme A reductase
Ligand
BDBM50014818
Substrate
Meas. Tech.
ChEBML_80667
IC50
30±n/a nM
Citation
 Beck, GKesseler, KBaader, EBartmann, WBergmann, AGranzer, EJendralla, Hvon Kerekjarto, BKrause, RPaulus, E Synthesis and biological activity of new HMG-CoA reductase inhibitors. 1. Lactones of pyridine- and pyrimidine-substituted 3,5-dihydroxy-6-heptenoic (-heptanoic) acids. J Med Chem 33:52-60 (1990)  
Target
Name:
3-hydroxy-3-methylglutaryl-coenzyme A reductase
Synonyms:
HMDH_RAT Hmgcr
Type:
Enzyme
Mol. Mass.:
96689.85
Organism:
Rattus norvegicus (rat)
Description:
Isolated rat liver microsomes were used as enzyme source.
Residue:
887
  
Inhibitor
Name:
BDBM50014818
Synonyms:
(E)-6-{2-[2-Cyclohexyl-4-(4-fluoro-phenyl)-6-phenyl-pyridin-3-yl]-vinyl}-4-hydroxy-tetrahydro-pyran-2-one | CHEMBL2368201
Type:
Small organic molecule
Emp. Form.:
C30H30FNO3
Mol. Mass.:
471.5625
SMILES:
O[C@@H]1C[C@H](OC(=O)C1)\C=C\c1c(nc(cc1-c1ccc(F)cc1)-c1ccccc1)C1CCCCC1
: