Target
3-hydroxy-3-methylglutaryl-coenzyme A reductase
Ligand
BDBM50014841
Substrate
Meas. Tech.
ChEBML_80478
IC50
5±n/a nM
Citation
 Beck, GKesseler, KBaader, EBartmann, WBergmann, AGranzer, EJendralla, Hvon Kerekjarto, BKrause, RPaulus, E Synthesis and biological activity of new HMG-CoA reductase inhibitors. 1. Lactones of pyridine- and pyrimidine-substituted 3,5-dihydroxy-6-heptenoic (-heptanoic) acids. J Med Chem 33:52-60 (1990)  
Target
Name:
3-hydroxy-3-methylglutaryl-coenzyme A reductase
Synonyms:
3-hydroxy-3-methylglutaryl-coenzyme A (HMG-CoA) reductase HMDH_HUMAN HMG-CoA reductase (HMGR) | HMGCR
Type:
Enzyme
Mol. Mass.:
97477.10
Organism:
Homo sapiens (Human)
Description:
P04035
Residue:
888
  
Inhibitor
Name:
BDBM50014841
Synonyms:
(E)-6-{2-[2-tert-Butyl-4-(4-fluoro-phenyl)-6-phenyl-pyridin-3-yl]-vinyl}-4-hydroxy-tetrahydro-pyran-2-one | CHEMBL2368199
Type:
Small organic molecule
Emp. Form.:
C27H26FNO3
Mol. Mass.:
431.4986
SMILES:
CC(C)c1nc(cc(-c2ccc(F)cc2)c1\C=C\[C@@H]1C[C@@H](O)CC(=O)O1)-c1ccccc1
: